{"text_format":"1","workbook":"xlsx","n_sheets":16,"sheets":["COVER","Methodology","Basic instructions","Table_1","Validation rules","Lists","Locks","CountryName","Summations","Mandatory","SimpleRatios","Thresholds","IsFormula","MustNotBeNegative","FootnoteContent","IsNumeric"],"not_rendered":{"charts":0,"images":3,"macros":1,"external_links":0,"defined_names":9,"comments":0,"pivot_tables":0},"unopened":[],"bounds":{"document_bytes":16777216,"sheet_cells":100000,"rows_first":2000,"rows_last":500,"rows_between":2000,"halvings":0,"cell_chars":16384,"cell_head_chars":4096},"cells_cut":0,"cells_raw":0,"read":"whole","date_system":"1900"}

{"sheet":"COVER","index":0,"n_rows":17,"n_cols":3,"rows_kept":17,"cut":false,"hidden":false,"merged":[[18,1,23,3],[1,1,1,3],[8,1,8,3],[9,1,9,3],[10,1,11,3],[16,1,16,3]]}
[]
[null,"Statistical Office of the European Union"]
[]
[]
[]
[]
[]
[]
[]
[null,"Directorate E: Sectoral and regional statistics"]
{"$rows_left_out":8}
{"sheet":"Methodology","index":1,"n_rows":19,"n_cols":2,"rows_kept":19,"cut":false,"hidden":false,"merged":[[8,1,8,2],[1,1,1,2],[4,1,4,2],[5,1,5,2],[6,1,6,2],[7,1,7,2],[16,1,16,2],[17,1,17,2],[18,1,18,2],[9,1,9,2],[10,1,10,2],[11,1,11,2],[13,1,13,2],[14,1,14,2],[15,1,15,2]]}
[]
[null,"DETAILED EXPLANATORY NOTES AND METHODOLOGY"]
[]
[]
[null,"Table of contents"]
[null,"1. Background"]
[null,"2. Legal acts"]
[null,"3. Data reporting - questionnaire"]
[]
[null,"1. Background"]
{"$rows_left_out":10}
{"sheet":"Basic instructions","index":2,"n_rows":75,"n_cols":10,"rows_kept":75,"cut":false,"hidden":false,"merged":[[10,2,10,4],[10,6,10,8],[2,2,2,15],[3,2,3,15],[5,2,5,15],[6,2,6,15],[8,2,8,15],[32,2,32,15],[13,2,13,15],[15,3,15,15],[17,3,17,15],[19,3,19,15],[21,3,21,15],[23,3,23,15],[24,2,24,15],[26,2,26,15],[27,2,27,15],[28,2,28,15],[29,2,29,15],[31,2,31,13],[30,5,30,10],[45,5,45,10],[34,2,34,15],[35,2,35,3],[36,2,36,3],[37,2,37,3],[39,2,39,14],[40,2,40,15],[37,6,37,11],[57,2,57,15],[46,2,46,13],[47,2,47,15],[48,2,48,15],[49,2,49,15],[50,2,50,15],[51,2,51,15],[52,2,52,15],[53,2,53,15],[54,2,54,15],[56,2,56,3],[59,2,59,15],[60,2,60,15],[61,2,61,15],[62,2,62,15],[63,2,63,15],[64,2,64,15],[65,2,65,15],[66,1,66,16],[67,2,67,15],[68,1,68,16],[69,3,69,15],[70,3,70,15],[75,1,75,16],[71,3,71,15],[72,3,72,15],[73,3,73,15],[74,3,74,15]]}
[]
[]
[null,null,"Biennial Statistics on Waste Generation\n2022 DATA COLLECTION"]
[null,null,"Basic instructions"]
[]
[null,null,"Before filling in the questionnaire please read carefully the instructions below. This EXCEL workbook is the questionnaire. Please do not  delete or add rows in the questionnaire. This EXCEL workbook contains macros. In order to make them work you need to save the file in your computer and then reopen it and enable macros resp. make it a trusted document. After you completely filled in the table and before sending it, please, validate the questionnaire with the button \"validate questionnaire\" above. You find the results of this immediate validation in the table \"ErrorLog\"."]
[null,null,"Please note that this questionnaire only includes one table."]
[]
[null,null,"1. Getting started "]
[null,null,"Enter the data without changing the format of the questionnaire (i.e. do not add/delete rows or columns) since Eurostat uses automated routines for data validation.\n"]
{"$rows_left_out":66}
{"sheet":"Table_1","index":3,"n_rows":136,"n_cols":116,"rows_kept":136,"cut":false,"hidden":false,"merged":[[5,46,5,50],[5,91,5,95],[5,86,5,90],[5,81,5,85],[5,76,5,80],[5,71,5,75],[6,99,6,100],[6,104,6,105],[6,109,6,110],[6,54,6,55],[6,59,6,60],[6,64,6,65],[6,69,6,70],[5,66,5,70],[5,61,5,65],[5,56,5,60],[5,51,5,55],[6,49,6,50],[6,114,6,115],[5,111,5,115],[5,106,5,110],[5,101,5,105],[5,96,5,100],[6,74,6,75],[6,79,6,80],[6,84,6,85],[6,89,6,90],[6,94,6,95],[5,6,5,10],[5,11,5,15],[6,44,6,45],[5,41,5,45],[5,36,5,40],[5,31,5,35],[5,26,5,30],[5,21,5,25],[5,16,5,20],[6,9,6,10],[6,14,6,15],[6,19,6,20],[6,24,6,25],[6,29,6,30],[6,34,6,35],[6,39,6,40],[88,1,90,1],[85,1,87,1],[82,1,84,1],[79,1,81,1],[76,1,78,1],[73,1,75,1],[25,1,27,1],[67,1,69,1],[64,1,66,1],[61,1,63,1],[58,1,60,1],[55,1,57,1],[52,1,54,1],[49,1,51,1],[70,1,72,1],[46,1,48,1],[43,1,45,1],[40,1,42,1],[97,1,99,1],[94,1,96,1],[91,1,93,1],[100,3,102,3],[103,3,105,3],[115,3,117,3],[115,1,117,1],[103,1,105,1],[100,1,102,1],[106,1,108,1],[106,3,108,3],[109,1,111,1],[109,3,111,3],[112,1,114,1],[112,3,114,3],[40,3,42,3],[94,3,96,3],[97,3,99,3],[46,3,48,3],[58,3,60,3],[61,3,63,3],[64,3,66,3],[67,3,69,3],[49,3,51,3],[52,3,54,3],[55,3,57,3],[43,3,45,3],[88,3,90,3],[91,3,93,3],[76,3,78,3],[79,3,81,3],[82,3,84,3],[85,3,87,3],[70,3,72,3],[73,3,75,3],[25,3,27,3],[37,1,39,1],[34,1,36,1],[31,1,33,1],[28,1,30,1],[7,1,9,1],[10,1,12,1],[13,1,15,1],[6,1,6,5],[16,1,18,1],[19,1,21,1],[22,1,24,1],[7,3,9,3],[10,3,12,3],[13,3,15,3],[16,3,18,3],[19,3,21,3],[22,3,24,3],[28,3,30,3],[31,3,33,3],[34,3,36,3],[37,3,39,3]]}
[]
[]
[null,"Country:",null,{"$f":"IF('Basic instructions'!$G$11=\"\",\"\",'Basic instructions'!$G$11)","v":"Croatia"},null,{"$f":"IF('Basic instructions'!$J$11=\"\",\"\",'Basic instructions'!$J$11)","v":"HR"}]
[null,"Reference year:",null,{"$f":"IF('Basic instructions'!$G$12=\"\",\"\",'Basic instructions'!$G$12)","v":2020}]
[null,null,null,null,null,null,"A",null,null,null,null,"B",null,null,null,null,"C10-C12",null,null,null,null,"C13-C15",null,null,null,null,"C16",null,null,null,null,"C17_C18",null,null,null,null,"C19",null,null,null,null,"C20-C22",null,null,null,null,"C23",null,null,null,null,"C24_C25",null,null,null,null,"C26-C30",null,null,null,null,"C31-C33",null,null,null,null,"C",null,null,null,null,"D",null,null,null,null,"E36_E37_E39",null,null,null,null,"E38",null,null,null,null,"E",null,null,null,null,"F",null,null,null,null,"G-U_X_G4677",null,null,null,null,"G4677",null,null,null,null,"EP_HH",null,null,null,null,"TOTAL_HH"]
[null,"Unit: Tonnes",null,"T",null,null,{"$f":"G5","v":"A"},null,null,null,null,{"$f":"L5","v":"B"},null,null,null,null,{"$f":"Q5","v":"C10-C12"},null,null,null,null,{"$f":"V5","v":"C13-C15"},null,null,null,null,{"$f":"AA5","v":"C16"},null,null,null,null,{"$f":"AF5","v":"C17_C18"},null,null,null,null,{"$f":"AK5","v":"C19"},null,null,null,null,{"$f":"AP5","v":"C20-C22"},null,null,null,null,{"$f":"AU5","v":"C23"},null,null,null,null,{"$f":"AZ5","v":"C24_C25"},null,null,null,null,{"$f":"BE5","v":"C26-C30"},null,null,null,null,{"$f":"BJ5","v":"C31-C33"},null,null,null,null,{"$f":"BO5","v":"C"},null,null,null,null,{"$f":"BT5","v":"D"},null,null,null,null,{"$f":"BY5","v":"E36_E37_E39"},null,null,null,null,{"$f":"CD5","v":"E38"},null,null,null,null,{"$f":"CI5","v":"E"},null,null,null,null,{"$f":"CN5","v":"F"},null,null,null,null,{"$f":"CS5","v":"G-U_X_G4677"},null,null,null,null,{"$f":"CX5","v":"G4677"},null,null,null,null,{"$f":"DC5","v":"EP_HH"},null,null,null,null,{"$f":"DH5","v":"TOTAL_HH"}]
[null,"WASTE GENERATION\nby waste category (EWC-STAT)\nand economic activity (NACE)",null,null,null,null,"Agriculture, forestry and fishing","Standard footnote","Confidentiality footnote","Explanatory footnote",null,"Mining and quarrying","Standard footnote","Confidentiality footnote","Explanatory footnote",null,"Manufacture of food products; beverages and tobacco products","Standard footnote","Confidentiality footnote","Explanatory footnote",null,"Manufacture of textiles, wearing apparel, leather and related products","Standard footnote","Confidentiality footnote","Explanatory footnote",null,"Manufacture of wood and of products of wood and cork, except furniture; manufacture of articles of straw and plaiting materials","Standard footnote","Confidentiality footnote","Explanatory footnote",null,"Manufacture of paper and paper products; printing and reproduction of recorded media","Standard footnote","Confidentiality footnote","Explanatory footnote",null,"Manufacture of coke and refined petroleum products","Standard footnote","Confidentiality footnote","Explanatory footnote",null,"Manufacture of chemical, pharmaceutical, rubber and plastic products","Standard footnote","Confidentiality footnote","Explanatory footnote",null,"Manufacture of other non-metallic mineral products","Standard footnote","Confidentiality footnote","Explanatory footnote",null,"Manufacture of basic metals and fabricated metal products, except machinery and equipment","Standard footnote","Confidentiality footnote","Explanatory footnote",null,"Manufacture of computer, electronic and optical products, electrical equipment, motor vehicles and other transport equipment","Standard footnote","Confidentiality footnote","Explanatory footnote",null,"Manufacture of furniture; jewellery, musical instruments, toys; repair and installation of machinery and equipment","Standard footnote","Confidentiality footnote","Explanatory footnote",null,"Manufacturing","Standard footnote","Confidentiality footnote","Explanatory footnote",null,"Electricity, gas, steam and air conditioning supply","Standard footnote","Confidentiality footnote","Explanatory footnote",null,"Water collection, treatment and supply; sewerage; remediation activities and other waste management services","Standard footnote","Confidentiality footnote","Explanatory footnote",null,"Waste collection, treatment and disposal activities; materials recovery","Standard footnote","Confidentiality footnote","Explanatory footnote",null,"Water supply; sewerage, waste management and remediation activities","Standard footnote","Confidentiality footnote","Explanatory footnote",null,"Construction","Standard footnote","Confidentiality footnote","Explanatory footnote",null,"Services (except wholesale of waste and scrap)","Standard footnote","Confidentiality footnote","Explanatory footnote",null,"Wholesale of waste and scrap","Standard footnote","Confidentiality footnote","Explanatory footnote",null,"Households","Standard footnote","Confidentiality footnote","Explanatory footnote",null,"All NACE activities plus households","Standard footnote","Confidentiality footnote","Explanatory footnote"]
[null,"W011","W011","Spent solvents ","HAZ","Hazardous ",0,null,null,null,null,0,null,null,null,null,0.36199999999999999,null,null,null,null,19.157,null,null,null,null,1.7549999999999999,null,null,null,null,86.156999999999996,null,null,null,null,77.19,null,null,null,null,1164.395,null,null,null,null,1.093,null,null,null,null,19.559000000000001,null,null,null,null,248.999,null,null,null,null,19.802,null,null,null,{"$f":"IF(TRIM(BM8)=\"\", \"\", IF(VLOOKUP(BM8,#REF!,2,FALSE)=0,\"\",VLOOKUP(BM8,#REF!,2,FALSE) ) )","v":""},{"$f":"IF(AND(TRIM(Q8)=\"\",TRIM(V8)=\"\",TRIM(AA8)=\"\", TRIM(AF8)=\"\", TRIM(AK8)=\"\", TRIM(AP8)=\"\", TRIM(AU8)=\"\", TRIM(AZ8)=\"\", TRIM(BE8)=\"\", TRIM(BJ8)=\"\"),\"\",Q8+V8+AA8+AF8+AK8+AP8+AU8+AZ8+BE8+BJ8)","v":1638.4690000000001},null,null,null,{"$f":"IF(TRIM(BR8)=\"\", \"\", IF(VLOOKUP(BR8,#REF!,2,FALSE)=0,\"\",VLOOKUP(BR8,#REF!,2,FALSE) ) )","v":""},0.104,null,null,null,null,0.17599999999999999,null,null,null,null,3.2469999999999999,null,null,null,{"$f":"IF(TRIM(CG8)=\"\", \"\", IF(VLOOKUP(CG8,#REF!,2,FALSE)=0,\"\",VLOOKUP(CG8,#REF!,2,FALSE) ) )","v":""},{"$f":"IF(AND(TRIM(BY8)=\"\",TRIM(CD8)=\"\"),\"\",BY8+CD8)","v":3.423},null,null,null,{"$f":"IF(TRIM(CL8)=\"\", \"\", IF(VLOOKUP(CL8,#REF!,2,FALSE)=0,\"\",VLOOKUP(CL8,#REF!,2,FALSE) ) )","v":""},1.44,null,null,null,null,70.974000000000004,null,null,null,null,0,null,null,null,null,0.27,null,null,null,{"$f":"IF(TRIM(DF8)=\"\", \"\", IF(VLOOKUP(DF8,#REF!,2,FALSE)=0,\"\",VLOOKUP(DF8,#REF!,2,FALSE) ) )","v":""},{"$f":"IF(AND(TRIM(G8)=\"\",TRIM(L8)=\"\",TRIM(BO8)=\"\",TRIM(BT8)=\"\",TRIM(CI8)=\"\",TRIM(CN8)=\"\",TRIM(CS8)=\"\",TRIM(CX8)=\"\",TRIM(DC8)=\"\"),\"\",SUM(G8,L8,BO8,BT8,CI8,CN8,CS8,CX8,DC8))","v":1714.68},null,null,null,{"$f":"IF(TRIM(DK8)=\"\", \"\", IF(VLOOKUP(DK8,#REF!,2,FALSE)=0,\"\",VLOOKUP(DK8,#REF!,2,FALSE) ) )","v":""}]
[null,null,null,null,null,"Not applicable",0,null,null,null,null,0,null,null,null,null,0,null,null,null,null,0,null,null,null,null,0,null,null,null,null,0,null,null,null,null,0,null,null,null,null,0,null,null,null,null,0,null,null,null,null,0,null,null,null,null,0,null,null,null,null,0,null,null,null,null,null,null,null,null,null,0,null,null,null,null,0,null,null,null,null,0,null,null,null,null,null,null,null,null,null,0,null,null,null,null,0,null,null,null,null,0,null,null,null,null,0]
[null,null,"W011",null,"HAZ_NHAZ","Total",{"$f":"IF(AND(TRIM(G8)=\"\",TRIM(G9)=\"\"),\"\",G8+G9)","v":0},null,null,null,null,{"$f":"IF(AND(TRIM(L8)=\"\",TRIM(L9)=\"\"),\"\",L8+L9)","v":0},null,null,null,null,{"$f":"IF(AND(TRIM(Q8)=\"\",TRIM(Q9)=\"\"),\"\",Q8+Q9)","v":0.36199999999999999},null,null,null,null,{"$f":"IF(AND(TRIM(V8)=\"\",TRIM(V9)=\"\"),\"\",V8+V9)","v":19.157},null,null,null,null,{"$f":"IF(AND(TRIM(AA8)=\"\",TRIM(AA9)=\"\"),\"\",AA8+AA9)","v":1.7549999999999999},null,null,null,null,{"$f":"IF(AND(TRIM(AF8)=\"\",TRIM(AF9)=\"\"),\"\",AF8+AF9)","v":86.156999999999996},null,null,null,null,{"$f":"IF(AND(TRIM(AK8)=\"\",TRIM(AK9)=\"\"),\"\",AK8+AK9)","v":77.19},null,null,null,null,{"$f":"IF(AND(TRIM(AP8)=\"\",TRIM(AP9)=\"\"),\"\",AP8+AP9)","v":1164.395},null,null,null,null,{"$f":"IF(AND(TRIM(AU8)=\"\",TRIM(AU9)=\"\"),\"\",AU8+AU9)","v":1.093},null,null,null,null,{"$f":"IF(AND(TRIM(AZ8)=\"\",TRIM(AZ9)=\"\"),\"\",AZ8+AZ9)","v":19.559000000000001},null,null,null,null,{"$f":"IF(AND(TRIM(BE8)=\"\",TRIM(BE9)=\"\"),\"\",BE8+BE9)","v":248.999},null,null,null,null,{"$f":"IF(AND(TRIM(BJ8)=\"\",TRIM(BJ9)=\"\"),\"\",BJ8+BJ9)","v":19.802},null,null,null,{"$f":"IF(TRIM(BM10)=\"\", \"\", IF(VLOOKUP(BM10,#REF!,2,FALSE)=0,\"\",VLOOKUP(BM10,#REF!,2,FALSE) ) )","v":""},{"$f":"IF(AND(TRIM(BO8)=\"\", TRIM(BO9)=\"\"), \"\", (IF(ISNUMBER(BO8),BO8,0)+IF(ISNUMBER(BO9),BO9,0)))","v":1638.4690000000001},null,null,null,{"$f":"IF(TRIM(BR10)=\"\", \"\", IF(VLOOKUP(BR10,#REF!,2,FALSE)=0,\"\",VLOOKUP(BR10,#REF!,2,FALSE) ) )","v":""},{"$f":"IF(AND(TRIM(BT8)=\"\",TRIM(BT9)=\"\"),\"\",BT8+BT9)","v":0.104},null,null,null,null,{"$f":"IF(AND(TRIM(BY8)=\"\",TRIM(BY9)=\"\"),\"\",BY8+BY9)","v":0.17599999999999999},null,null,null,null,{"$f":"IF(AND(TRIM(CD8)=\"\",TRIM(CD9)=\"\"),\"\",CD8+CD9)","v":3.2469999999999999},null,null,null,{"$f":"IF(TRIM(CG10)=\"\", \"\", IF(VLOOKUP(CG10,#REF!,2,FALSE)=0,\"\",VLOOKUP(CG10,#REF!,2,FALSE) ) )","v":""},{"$f":"IF(AND(TRIM(CI8)=\"\", TRIM(CI9)=\"\"), \"\", (IF(ISNUMBER(CI8),CI8,0)+IF(ISNUMBER(CI9),CI9,0)))","v":3.423},null,null,null,{"$f":"IF(TRIM(CL10)=\"\", \"\", IF(VLOOKUP(CL10,#REF!,2,FALSE)=0,\"\",VLOOKUP(CL10,#REF!,2,FALSE) ) )","v":""},{"$f":"IF(AND(TRIM(CN8)=\"\",TRIM(CN9)=\"\"),\"\",CN8+CN9)","v":1.44},null,null,null,null,{"$f":"IF(AND(TRIM(CS8)=\"\",TRIM(CS9)=\"\"),\"\",CS8+CS9)","v":70.974000000000004},null,null,null,null,{"$f":"IF(AND(TRIM(CX8)=\"\",TRIM(CX9)=\"\"),\"\",CX8+CX9)","v":0},null,null,null,null,{"$f":"IF(AND(TRIM(DC8)=\"\",TRIM(DC9)=\"\"),\"\",DC8+DC9)","v":0.27},null,null,null,{"$f":"IF(TRIM(DF10)=\"\", \"\", IF(VLOOKUP(DF10,#REF!,2,FALSE)=0,\"\",VLOOKUP(DF10,#REF!,2,FALSE) ) )","v":""},{"$f":"IF(AND(TRIM(DH8)=\"\", TRIM(DH9)=\"\"), \"\", SUM(DH8,DH9) )","v":1714.68},null,null,null,{"$f":"IF(TRIM(DK10)=\"\", \"\", IF(VLOOKUP(DK10,#REF!,2,FALSE)=0,\"\",VLOOKUP(DK10,#REF!,2,FALSE) ) )","v":""}]
{"$rows_left_out":127}
{"sheet":"Validation rules","index":4,"n_rows":29,"n_cols":5,"rows_kept":29,"cut":false,"hidden":false,"merged":[]}
[]
[null,null,"Preliminary checks:","ESTAT technical instructions for VB rules development","ESTAT technical instructions for CONVAL rules development"]
[]
["COUNTRYCODE",null,"The reporting country name must be filled in the sheet \"Basic Instructions\".","See hidden sheet \"Country code\"","This looks more like a STRUVAL rule (country code must not be empty)"]
[]
[null,null,"Mandatory Data:"]
[]
["MANDATORY",null,"All the mandatory cells (white cells) in table 1 must be filled-in.","See hidden sheet \"Mandatory\"","E2 to provide list of mandatory primary keys. Notice it is allowed a null (NaN) obs_value if a footnote (obs_comment) is provided"]
[null,null,"If mandatory cells are left empty, an explanation why the data is missing has to be provided by means of the \"Explanatory footnote\" next to the missing value. ","This is controlled in the VB rule by the parameter \"EmptyIsValidIfFootnoteExists\". This parameter is defined in the hidden sheet \"Mandatory\". Notice we check the footnote in the hidden column copying the footnote text, and not for the visible column with the footnote call. This is in case the user set as footnote a number (call) with no text associated in the \"Footnote List\" sheet."]
[]
{"$rows_left_out":20}
{"sheet":"Lists","index":5,"n_rows":42,"n_cols":8,"rows_kept":42,"cut":false,"hidden":true,"merged":[]}
["Country label","Country code",null,"Valid flags","Label",null,"Code","Description"]
["Belgium","BE",null,"B","Break in time series",null,"C","confidential"]
["Bulgaria","BG",null,"E","Estimated data",null,"D","secondary confidentiality set by the sender"]
["Czechia","CZ",null,"P","Provisional"]
["Denmark","DK",null,"BE","Break in time series, estimated"]
["Germany","DE",null,"BP","Break in time series, provisional"]
["Estonia","EE",null,"EP","Estimated, provisional"]
["Ireland","IE",null,"BEP","Break in time series, estimated, provisional"]
["Greece","EL"]
["Spain","ES"]
{"$rows_left_out":33}
{"sheet":"Locks","index":6,"n_rows":37,"n_cols":8,"rows_kept":37,"cut":false,"hidden":true,"merged":[]}
["SheetName","Top Left Cell","Bottom Right Cell","Row Step","Column Step","Lock Type","Focus Back To","IMPORTANT: The same cell must not be included in two ranges. In such a case the switch will operate twice, leaving the cell in the same original state"]
["Table_1","G10","BJ106",3,5,"Formulas","G8","Hazardous + non hazardous (left block, until NACE C)"]
["Table_1","BT10","CD106",3,5,"Formulas","G8","Hazardous + non hazardous (Middle block, between NACE C and E)"]
["Table_1","CN10","DC106",3,5,"Formulas","G8","Hazardous + non hazardous (Right block, between NACE E and Total NACE)"]
["Table_1","G107","DH118",1,5,"Formulas","G8","Bottom grand totals"]
["Table_1","BO8","CI8",999,20,"Formulas","G8","NACE C and NACE E"]
["Table_1","BO10","CI14",1,20,"Formulas","G8","NACE C and NACE E"]
["Table_1","BO16","CI28",1,20,"Formulas","G8","NACE C and NACE E"]
["Table_1","BO30","CI31",1,20,"Formulas","G8","NACE C and NACE E"]
["Table_1","BO33","CI34",1,20,"Formulas","G8","NACE C and NACE E"]
{"$rows_left_out":28}
{"sheet":"CountryName","index":7,"n_rows":16,"n_cols":6,"rows_kept":16,"cut":false,"hidden":true,"merged":[]}
["Severity","SheetName","TopLeftCell","BottomRightCell","RowStep","ColumnStep"]
["Error","Basic instructions","G11","G11",1,1]
[]
[]
[]
["DESCRIPTION"]
["Spot the position where the reporting country is defined"]
[]
["PARAMETERS"]
[{"$f":"B1","v":"SheetName"},"Name of the sheet to be validated (e.g. Table 1)"]
{"$rows_left_out":7}
{"sheet":"Summations","index":8,"n_rows":110,"n_cols":11,"rows_kept":110,"cut":false,"hidden":true,"merged":[[11,5,11,6]]}
["Severity","Sheet Name","List of Cells\n (first block)","First Total Cell (first block)","Last Total Cell\n(Last block)","Row Block Repetition Step","Column Block Repetition Step","Greater or Equal","Valid Threshold","Only if all data is available","Display text in error"]
["Error","Table_1","G8,G11,G14,G17,G20,G26,G29,G32,G35,G38,G41,G44,G47,G50,G53,G56,G59,G62,G65,G68,G71,G74,G77,G80,G86,G89,G92,G95,G98,G101","G107","DH109",1,5,"EQ",0.1,"NO","Primary Waste"]
["Error","Table_1","G23,G83,G104","G110","DH112",1,5,"EQ",0.1,"NO","Secondary Waste"]
["Error","Table_1","G8,G11,G14,G17,G20,G23,G26,G29,G32,G35,G38,G41,G44,G47,G50,G53,G56,G59,G62,G65,G68,G71,G74,G77,G80,G83,G86,G95,G104","G113","DH115",1,5,"EQ",0.1,"NO","Total Waste (excluding mineral waste)"]
["Error","Table_1","G8,G11,G14,G17,G20,G23,G26,G29,G32,G35,G38,G41,G44,G47,G50,G53,G56,G59,G62,G65,G68,G71,G74,G77,G80,G83,G86,G89,G92,G95,G98,G101,G104","G116","DH118",1,5,"EQ",0.1,"NO","Waste total"]
["Error","Table_1","G8,G9","G10","DH118",3,5,"EQ",0.1,"NO","Total = Haz. + Non-Haz."]
["Error","Table_1","Q8,V8,AA8,AF8,AK8,AP8,AU8,AZ8,BE8,BJ8","BO8","BO118",1,9999,"EQ",0.1,"NO","NACE C"]
["Error","Table_1","BY8,CD8","CI8","CI118",1,9999,"EQ",0.1,"NO","NACE E"]
["Error","Table_1","G8,L8,BO8,BT8,CI8,CN8,CS8,CX8,DC8","DH8","DH118",1,9999,"EQ",0.1,"NO","Total NACE + Households"]
[]
{"$rows_left_out":101}
{"sheet":"Mandatory","index":9,"n_rows":18,"n_cols":8,"rows_kept":18,"cut":false,"hidden":true,"merged":[]}
["Severity","SheetName","Top Left Cell","Bottom Right Cell","Row Step","Column Step","Empty Is Valid If Footnote Exists","Footnote Shift From Value"]
["Error","Table_1","G8","DC8",1,5,"YES",4]
["Error","Table_1","G10","DC14",1,5,"YES",4]
["Error","Table_1","G16","DC28",1,5,"YES",4]
["Error","Table_1","G30","DC31",1,5,"YES",4]
["Error","Table_1","G33","DC34",1,5,"YES",4]
["Error","Table_1","G36","DC40",1,5,"YES",4]
["Error","Table_1","G42","DC43",1,5,"YES",4]
["Error","Table_1","G45","DC46",1,5,"YES",4]
["Error","Table_1","G48","DC52",1,5,"YES",4]
{"$rows_left_out":9}
{"sheet":"SimpleRatios","index":10,"n_rows":6,"n_cols":15,"rows_kept":6,"cut":false,"hidden":true,"merged":[[5,6,5,7]]}
["Severity","Sheet Name","Numerator\n (first block)","Denominator (first block)","First result\n(First block)","Last result\n(Last block)","Row Block Repetition Step","Column Block Repetition Step","Numerator multiplied by ","Ratio Greater or Equal than result cell","Valid Tolerance","If denominator = 0","Display text in error","Accept error If Footnote Exists","Column shift from value to footnote"]
[]
[]
[]
[]
[null,null,null,null,null,null,"Must be > 0 for a not relevant dimension. Else you get an infinite loop"]

{"sheet":"Thresholds","index":11,"n_rows":1,"n_cols":8,"rows_kept":1,"cut":false,"hidden":true,"merged":[]}
["Severity","SheetName","Top Left Cell","Bottom Right Cell","Row Step","Column Step","Lower value","Upper value"]

{"sheet":"IsFormula","index":12,"n_rows":37,"n_cols":7,"rows_kept":37,"cut":false,"hidden":true,"merged":[]}
["Severity","Sheet Name","Top Left Cell","Bottom Right Cell","Row Step","Column Step"]
["Info","Table_1","G10","BJ106",3,5,"Hazardous + non hazardous (left block, until NACE C)"]
["Info","Table_1","BT10","CD106",3,5,"Hazardous + non hazardous (Middle block, between NACE C and E)"]
["Info","Table_1","CN10","DC106",3,5,"Hazardous + non hazardous (Right block, between NACE E and Total NACE)"]
["Info","Table_1","G107","DH118",1,5,"Bottom grand totals"]
["Info","Table_1","BO8","CI8",999,20,"NACE C and NACE E"]
["Info","Table_1","BO10","CI14",1,20,"NACE C and NACE E"]
["Info","Table_1","BO16","CI28",1,20,"NACE C and NACE E"]
["Info","Table_1","BO30","CI31",1,20,"NACE C and NACE E"]
["Info","Table_1","BO33","CI34",1,20,"NACE C and NACE E"]
{"$rows_left_out":28}
{"sheet":"MustNotBeNegative","index":13,"n_rows":2,"n_cols":6,"rows_kept":2,"cut":false,"hidden":true,"merged":[]}
["Severity","SheetName","TopLeftCell","BottomRightCell","RowStep","ColumnStep"]
["Error","Table_1","G8","DC118",1,5]

{"sheet":"FootnoteContent","index":14,"n_rows":2,"n_cols":7,"rows_kept":2,"cut":false,"hidden":true,"merged":[]}
["Severity","SheetName","TopLeftCell","BottomRightCell","RowStep","ColumnStep","DistanceFromReferenceToText"]
["Error","Table_1","J8","DK118",1,5,1]

{"sheet":"IsNumeric","index":15,"n_rows":2,"n_cols":6,"rows_kept":2,"cut":false,"hidden":true,"merged":[]}
["Severity","SheetName","TopLeftCell","BottomRightCell","RowStep","ColumnStep"]
["Error","Table_1","G8","DC118",1,5]